Target
Prostaglandin E2 receptor EP4 subtype
Ligand
BDBM50156553
Substrate
Meas. Tech.
ChEMBL_429537 (CHEMBL918078)
EC50
0.2±n/a nM
Citation
 Elworthy, TRBrill, ERChiou, SSChu, FHarris, JRHendricks, RTHuang, JKim, WLach, LKMirzadegan, TYee, CWalker, KA Lactams as EP4 prostanoid receptor agonists. 3. Discovery of N-ethylbenzoic acid 2-pyrrolidinones as subtype selective agents. J Med Chem 47:6124-7 (2004)  
Target
Name:
Prostaglandin E2 receptor EP4 subtype
Synonyms:
PE2R4_HUMAN PGE2 receptor EP4 subtype PTGER4 Prostanoid EP4 receptor
Type:
Enzyme
Mol. Mass.:
53134.53
Organism:
Homo sapiens (Human)
Description:
P35408
Residue:
488
  
Inhibitor
Name:
BDBM50156553
Synonyms:
4-(2-((R)-2-((S,E)-5-cyclobutyl-3-hydroxypent-1-enyl)-5-oxopyrrolidin-1-yl)ethyl)benzoic acid | CHEMBL222782
Type:
Small organic molecule
Emp. Form.:
C22H29NO4
Mol. Mass.:
371.47
SMILES:
O[C@@H](CCC1CCC1)\C=C\[C@H]1CCC(=O)N1CCc1ccc(cc1)C(O)=O
: