Target
Prostaglandin E2 receptor EP3 subtype
Ligand
BDBM50156548
Substrate
Meas. Tech.
ChEMBL_429535 (CHEMBL918076)
Ki
>100000±n/a nM
Citation
 Elworthy, TRBrill, ERChiou, SSChu, FHarris, JRHendricks, RTHuang, JKim, WLach, LKMirzadegan, TYee, CWalker, KA Lactams as EP4 prostanoid receptor agonists. 3. Discovery of N-ethylbenzoic acid 2-pyrrolidinones as subtype selective agents. J Med Chem 47:6124-7 (2004)  
Target
Name:
Prostaglandin E2 receptor EP3 subtype
Synonyms:
PE2R3_HUMAN PGE2-R Prostaglandin E2 receptor Prostaglandin E2 receptor EP3 subtype (EP3) Prostaglandin E2 receptor EP3D subtype (EP3D) | Prostanoid EP3 receptor
Type:
Enzyme
Mol. Mass.:
43335.03
Organism:
Homo sapiens (Human)
Description:
P43115
Residue:
390
  
Inhibitor
Name:
BDBM50156548
Synonyms:
5-(2-((R)-2-((S,E)-3-hydroxyoct-1-enyl)-5-oxopyrrolidin-1-yl)ethyl)thiophene-2-carboxylic acid | CHEMBL224970
Type:
Small organic molecule
Emp. Form.:
C19H27NO4S
Mol. Mass.:
365.487
SMILES:
CCCCC[C@H](O)\C=C\[C@H]1CCC(=O)N1CCc1ccc(s1)C(O)=O
: