Target
Prostaglandin G/H synthase 2
Ligand
BDBM50156588
Substrate
Meas. Tech.
ChEMBL_429562 (CHEMBL919560)
IC50
820±n/a nM
Citation
 Pommery, NTaverne, TTelliez, AGoossens, LCharlier, CPommery, JGoossens, JFHoussin, RDurant, FHénichart, JP New COX-2/5-LOX inhibitors: apoptosis-inducing agents potentially useful in prostate cancer chemotherapy. J Med Chem 47:6195-206 (2004)  
Target
Name:
Prostaglandin G/H synthase 2
Synonyms:
COX2 Cyclooxygenase 2 (COX-2) Cyclooxygenase-2 (COX-2 AA) Cyclooxygenase-2 (COX-2) PGH2_HUMAN PHS II Prostaglandin E synthase/G/H synthase 2 Prostaglandin-endoperoxide synthase 2
Type:
Enzyme
Mol. Mass.:
69003.89
Organism:
Homo sapiens (Human)
Description:
Recombinant Cox-2 provided by Cayman (Cayman Chemical Co.,Ann Arbor, MI).
Residue:
604
  
Inhibitor
Name:
BDBM50156588
Synonyms:
1-(4-trifluoromethoxyphenyl)-3-[3-fluoro-5-(4-methoxytetrahydropyran-4-yl)phenoxymethyl]-5-phenyl-1H-pyrazole | CHEMBL222482
Type:
Small organic molecule
Emp. Form.:
C29H26F4N2O4
Mol. Mass.:
542.5214
SMILES:
COC1(CCOCC1)c1cc(F)cc(OCc2cc(-c3ccccc3)n(n2)-c2ccc(OC(F)(F)F)cc2)c1
: