Target
Polyunsaturated fatty acid 5-lipoxygenase
Ligand
BDBM50156588
Substrate
Meas. Tech.
ChEMBL_429564 (CHEMBL919562)
IC50
850±n/a nM
Citation
 Pommery, NTaverne, TTelliez, AGoossens, LCharlier, CPommery, JGoossens, JFHoussin, RDurant, FHénichart, JP New COX-2/5-LOX inhibitors: apoptosis-inducing agents potentially useful in prostate cancer chemotherapy. J Med Chem 47:6195-206 (2004)  
Target
Name:
Polyunsaturated fatty acid 5-lipoxygenase
Synonyms:
5-LO 5-Lipoxygenase (5-LO) 5-Lipoygenase ALOX5 LOG5 | LOX5_HUMAN
Type:
Enzyme
Mol. Mass.:
77972.74
Organism:
Homo sapiens (Human)
Description:
Recombinant protein was purified from E. coli lysate. After ammonium sulfate precipitation and subsequent steps, the supernatant (S100) was used for 5-LO activity assay.
Residue:
674
  
Inhibitor
Name:
BDBM50156588
Synonyms:
1-(4-trifluoromethoxyphenyl)-3-[3-fluoro-5-(4-methoxytetrahydropyran-4-yl)phenoxymethyl]-5-phenyl-1H-pyrazole | CHEMBL222482
Type:
Small organic molecule
Emp. Form.:
C29H26F4N2O4
Mol. Mass.:
542.5214
SMILES:
COC1(CCOCC1)c1cc(F)cc(OCc2cc(-c3ccccc3)n(n2)-c2ccc(OC(F)(F)F)cc2)c1
: