Target
Histamine H2 receptor
Ligand
BDBM50156895
Substrate
Meas. Tech.
ChEMBL_429753 (CHEMBL914453)
IC50
2900±n/a nM
Citation
 Fonquerna, SMiralpeix, MPagès, LPuig, CCardús, AAntón, FCárdenas, AVilella, DAparici, MCalaf, EPrieto, JGras, JHuerta, JMWarrellow, GBeleta, JRyder, H Synthesis and structure-activity relationships of novel histamine H1 antagonists: indolylpiperidinyl benzoic acid derivatives. J Med Chem 47:6326-37 (2004)  
Target
Name:
Histamine H2 receptor
Synonyms:
Gastric receptor I HISTAMINE H2 HRH2_HUMAN Histamine H2-Gs alpha S
Type:
G Protein-Coupled Receptor (GPCR)
Mol. Mass.:
40115.31
Organism:
Homo sapiens (Human)
Description:
Residue:
359
  
Inhibitor
Name:
BDBM50156895
Synonyms:
2-(2-(4-(1-(2-ethoxyethyl)-6-(trifluoromethyl)-1H-indol-3-yl)piperidin-1-yl)ethoxy)benzoic acid | CHEMBL221718
Type:
Small organic molecule
Emp. Form.:
C27H31F3N2O4
Mol. Mass.:
504.5412
SMILES:
CCOCCn1cc(C2CCN(CCOc3ccccc3C(O)=O)CC2)c2ccc(cc12)C(F)(F)F
: