Target
C-C chemokine receptor type 5
Ligand
BDBM50156975
Substrate
Meas. Tech.
ChEMBL_306744 (CHEMBL830074)
IC50
320±n/a nM
Citation
 Burrows, JNCumming, JGFillery, SMHamlin, GAHudson, JAJackson, RJMcLaughlin, SShaw, JS Modulators of the human CCR5 receptor. Part 1: Discovery and initial SAR of 1-(3,3-diphenylpropyl)-piperidinyl amides and ureas. Bioorg Med Chem Lett 15:25-8 (2004)  
Target
Name:
C-C chemokine receptor type 5
Synonyms:
C-C CKR-5 CC-CKR-5 CCR5 CCR5_HUMAN CHEMR13 HIV-1 fusion coreceptor
Type:
Enzyme
Mol. Mass.:
40540.21
Organism:
Homo sapiens (Human)
Description:
P51681
Residue:
352
  
Inhibitor
Name:
BDBM50156975
Synonyms:
1-[1-(3,3-Diphenyl-propyl)-piperidin-4-yl]-1-ethyl-3-p-tolyl-urea | CHEMBL426250
Type:
Small organic molecule
Emp. Form.:
C30H37N3O
Mol. Mass.:
455.6343
SMILES:
CCN(C1CCN(CCC(c2ccccc2)c2ccccc2)CC1)C(=O)Nc1ccc(C)cc1
: