Target
Beta-secretase 1
Ligand
BDBM50157300
Substrate
Meas. Tech.
ChEMBL_302962 (CHEMBL828806)
Ki
27±n/a nM
Citation
 Tanaka, RSakano, YNagatsu, AShibuya, MEbizuka, YGoda, Y Synthesis of digalactosyl diacylglycerols and their structure-inhibitory activity on human lanosterol synthase. Bioorg Med Chem Lett 15:159-62 (2004)  
Target
Name:
Beta-secretase 1
Synonyms:
ASP2 Aspartyl protease 2 BACE1 Beta-secretase (BACE) Beta-secretase 1 (BACE 1) Beta-secretase 1 (BACE1) Beta-site amyloid precursor protein cleaving enzyme 1 Memapsin-2 beta-Secretase (BACE-1) | beta-Secretase (BACE1)
Type:
Protein
Mol. Mass.:
55755.10
Organism:
Homo sapiens (Human)
Description:
P56817
Residue:
501
  
Inhibitor
Name:
BDBM50157300
Synonyms:
(1-{(S)-2-Allylcarbamoyl-1-[(1S,2S,4R)-4-((S)-1-benzylcarbamoyl-2-methyl-propylcarbamoyl)-2-hydroxy-1-isobutyl-pentylcarbamoyl]-ethylcarbamoyl}-2-methyl-propyl)-carbamic acid allyl ester | CHEMBL181262
Type:
Small organic molecule
Emp. Form.:
C38H60N6O8
Mol. Mass.:
728.9184
SMILES:
CC(C)C[C@H](NC(=O)[C@H](CC(=O)NCC=C)NC(=O)C(NC(=O)OCC=C)C(C)C)[C@@H](O)C[C@@H](C)C(=O)N[C@@H](C(C)C)C(=O)NCc1ccccc1
: