Target
Integrin alpha-L/Intercellular adhesion molecule 1
Ligand
BDBM50157347
Substrate
Meas. Tech.
ChEMBL_305391 (CHEMBL833042)
IC50
160±n/a nM
Citation
 Wang, GTWang, SGentles, RSowin, TLeitza, SReilly, EBvon Geldern, TW Amino-substituted heterocycles as isosteres of trans-cinnamides: design and synthesis of heterocyclic biaryl sulfides as potent antagonists of LFA-1/ICAM-1 binding. Bioorg Med Chem Lett 15:195-201 (2004)  
Target
Name:
Integrin alpha-L/Intercellular adhesion molecule 1
Synonyms:
Intercellular adhesion molecule-1 /Leukocyte adhesion glycoprotein LFA-1 alpha
Type:
Mol. Mass.:
Description:
ASSAY_ID of EBI is 90530
Components:
This complex has 2 components.
Component 1
Name:
Integrin alpha-L
Synonyms:
CD11 antigen-like family member A CD_antigen=CD11a ITGAL LFA-1A Leukocyte adhesion glycoprotein LFA-1 alpha chain | Leukocyte function-associated molecule 1 alpha chain
Type:
PROTEIN
Mol. Mass.:
128748.90
Organism:
Homo sapiens (Human)
Description:
ChEMBL_629045
Residue:
1170
  
Component 2
Name:
Intercellular adhesion molecule 1
Synonyms:
CD_antigen=CD54 ICAM1 Intercellular adhesion molecule (ICAM-1), Integrin alpha-L/beta-2 Intercellular adhesion molecule-1 | Major group rhinovirus receptor
Type:
PROTEIN
Mol. Mass.:
57831.10
Organism:
Homo sapiens (Human)
Description:
ChEMBL_826675
Residue:
532
  
Inhibitor
Name:
BDBM50157347
Synonyms:
CHEMBL181377 | {4''-[4-(2-Isopropyl-phenylsulfanyl)-3-trifluoromethyl-phenyl]-3,4,5,6-tetrahydro-2H-[1,2'']bipyridinyl-4-yl}-methanol
Type:
Small organic molecule
Emp. Form.:
C27H29F3N2OS
Mol. Mass.:
486.592
SMILES:
CC(C)c1ccccc1Sc1ccc(cc1C(F)(F)F)-c1ccnc(c1)N1CCC(CO)CC1
: