Target
Adenosine receptor A3
Ligand
BDBM50157672
Substrate
Meas. Tech.
ChEMBL_430072 (CHEMBL918094)
Ki
22±n/a nM
Citation
 Chang, LCSpanjersberg, RFvon Frijtag Drabbe Künzel, JKMulder-Krieger, Tvan den Hout, GBeukers, MWBrussee, JIjzerman, AP 2,4,6-trisubstituted pyrimidines as a new class of selective adenosine A1 receptor antagonists. J Med Chem 47:6529-40 (2004)  
Target
Name:
Adenosine receptor A3
Synonyms:
A3 adenosine receptor (hA3) ADORA3 | Adenosine A3 receptor (A3AR)
Type:
G Protein-Coupled Receptor (GPCR)
Mol. Mass.:
36197.32
Organism:
Homo sapiens (Human)
Description:
P0DMS8
Residue:
318
  
Inhibitor
Name:
BDBM50157672
Synonyms:
CHEMBL222474 | N-(2,6-diphenylpyrimidin-4-yl)propionamide
Type:
Small organic molecule
Emp. Form.:
C19H17N3O
Mol. Mass.:
303.3578
SMILES:
CCC(=O)Nc1cc(nc(n1)-c1ccccc1)-c1ccccc1
: