Target
Mu-type opioid receptor
Ligand
BDBM50157685
Substrate
Meas. Tech.
ChEMBL_430080 (CHEMBL918102)
Ki
380±n/a nM
Citation
 Balboni, GSalvadori, SDal Piaz, ABortolotti, FArgazzi, RNegri, LLattanzi, RBryant, SDJinsmaa, YLazarus, LH Highly selective fluorescent analogue of the potent delta-opioid receptor antagonist Dmt-Tic. J Med Chem 47:6541-6 (2004)  
Target
Name:
Mu-type opioid receptor
Synonyms:
MOR-1 Mu-type opioid receptor (MOR) OPRM_RAT Opioid receptor B Ror-b
Type:
G Protein-Coupled Receptor (GPCR)
Mol. Mass.:
44503.11
Organism:
Rattus norvegicus (rat)
Description:
Competition binding assays were carried out using membrane preparations from transfected HN9.10 cells that constitutively expressed the mu opioid receptor.
Residue:
398
  
Inhibitor
Name:
BDBM50157685
Synonyms:
CHEMBL225479 | H-Dmt-Tic-Glu-NH-(CH2)5-NH2
Type:
Small organic molecule
Emp. Form.:
C31H43N5O6
Mol. Mass.:
581.703
SMILES:
Cc1cc(O)cc(C)c1C[C@H](N)C(=O)N1Cc2ccccc2CC1C(=O)N[C@@H](CCC(O)=O)C(=O)NCCCCCN
: