Target
Delta-type opioid receptor
Ligand
BDBM50157685
Substrate
Meas. Tech.
ChEMBL_430079 (CHEMBL918101)
Ki
0.22±n/a nM
Citation
 Balboni, GSalvadori, SDal Piaz, ABortolotti, FArgazzi, RNegri, LLattanzi, RBryant, SDJinsmaa, YLazarus, LH Highly selective fluorescent analogue of the potent delta-opioid receptor antagonist Dmt-Tic. J Med Chem 47:6541-6 (2004)  
Target
Name:
Delta-type opioid receptor
Synonyms:
Cytochrome P450 3A4 Delta opioid receptor Delta-type opioid receptor (DOR) OPRD_RAT Opioid receptor Opioid receptors; mu & delta Ror-a | Voltage-gated potassium channel
Type:
G Protein-Coupled Receptor (GPCR)
Mol. Mass.:
40465.04
Organism:
Rattus norvegicus (rat)
Description:
Competition binding assays were using CHO-K1 cell membranes expressing the opioid receptor.
Residue:
372
  
Inhibitor
Name:
BDBM50157685
Synonyms:
CHEMBL225479 | H-Dmt-Tic-Glu-NH-(CH2)5-NH2
Type:
Small organic molecule
Emp. Form.:
C31H43N5O6
Mol. Mass.:
581.703
SMILES:
Cc1cc(O)cc(C)c1C[C@H](N)C(=O)N1Cc2ccccc2CC1C(=O)N[C@@H](CCC(O)=O)C(=O)NCCCCCN
: