Target
Beta-lactamase
Ligand
BDBM50157693
Substrate
Meas. Tech.
ChEMBL_430086 (CHEMBL918107)
IC50
3±n/a nM
Citation
 Venkatesan, AMGu, YDos Santos, OAbe, TAgarwal, AYang, YPetersen, PJWeiss, WJMansour, TSNukaga, MHujer, AMBonomo, RAKnox, JR Structure-activity relationship of 6-methylidene penems bearing tricyclic heterocycles as broad-spectrum beta-lactamase inhibitors: crystallographic structures show unexpected binding of 1,4-thiazepine intermediates. J Med Chem 47:6556-68 (2004)  
Target
Name:
Beta-lactamase
Synonyms:
AMPC_ENTCL | ampC
Type:
PROTEIN
Mol. Mass.:
41306.67
Organism:
Enterobacter cloacae
Description:
ChEMBL_40258
Residue:
381
  
Inhibitor
Name:
BDBM50157693
Synonyms:
(5R,6Z)-6-[(7-chloroimidazo[2,1-b][1,3]-benzothiazol-2-ylmethylene)-7-oxo-4-thia-1-azabicyclo-[3.2.0]hept-2-ene-2-carboxylic acid sodium | CHEMBL388778
Type:
Small organic molecule
Emp. Form.:
C16H7ClN3NaO3S2
Mol. Mass.:
411.818
SMILES:
[Na]OC(=O)C1=CS[C@H]2N1C(=O)\C2=C\c1cn2c(n1)sc1cc(Cl)ccc21
: