Target
Bromodomain testis-specific protein
Ligand
BDBM50569836
Substrate
Meas. Tech.
ChEMBL_2184246 (CHEMBL5096328)
IC50
11±n/a nM
Citation
 Ren, QGao, W Current status in the discovery of dual BET/HDAC inhibitors. Bioorg Med Chem Lett 31:0 (2021) Target
Name:
Bromodomain testis-specific protein
Synonyms:
BRDT Bromodomain and extra-terminal motif (BET) Cancer/testis antigen 9 | RING3-like protein
Type:
PROTEIN
Mol. Mass.:
107982.01
Organism:
Homo sapiens (Human)
Description:
ChEMBL_1502985
Residue:
947
  
Inhibitor
Name:
BDBM50569836
Synonyms:
CHEMBL4850926
Type:
Small organic molecule
Emp. Form.:
C26H23ClN6O3S
Mol. Mass.:
535.017
SMILES:
Cc1sc-2c(c1C)C(=N[C@@H](CC(=O)Nc1ccc(cc1)C(=O)NO)c1nnc(C)n-21)c1ccc(Cl)cc1
: