Target
Transient receptor potential cation channel subfamily V member 6
Ligand
BDBM50511105
Substrate
Meas. Tech.
ChEMBL_2184553 (CHEMBL5096635)
IC50
9400±n/a nM
Citation
 Sampson, PB Phytocannabinoid Pharmacology: Medicinal Properties of  J Nat Prod 84:142-160 (2021) Target
Name:
Transient receptor potential cation channel subfamily V member 6
Synonyms:
CaT-L CaT1 ECAC2 TRPV6 | TRPV6_HUMAN
Type:
PROTEIN
Mol. Mass.:
87295.84
Organism:
Homo sapiens (Human)
Description:
ChEMBL_103784
Residue:
765
  
Inhibitor
Name:
BDBM50511105
Synonyms:
GWP-42004 O-4394 Tetrahydrocannabivarin
Type:
Small organic molecule
Emp. Form.:
C19H26O2
Mol. Mass.:
286.4085
SMILES:
[H][C@@]12C=C(C)CC[C@@]1([H])C(C)(C)Oc1cc(CCC)cc(O)c21
: