Target
NF-kappa-B essential modulator
Ligand
BDBM50587701
Substrate
Meas. Tech.
ChEMBL_2184657 (CHEMBL5096739)
Kd
80±n/a nM
Citation
 Hiesinger, KDar'in, DProschak, EKrasavin, M Spirocyclic Scaffolds in Medicinal Chemistry. J Med Chem 64:150-183 (2021) Target
Name:
NF-kappa-B essential modulator
Synonyms:
FIP3 Inhibitor of NF-kappa-B kinase (IKK) NEMO_HUMAN | NF-kappa-B essential modulator
Type:
PROTEIN
Mol. Mass.:
48190.12
Organism:
Homo sapiens (Human)
Description:
ChEMBL_84013
Residue:
419
  
Inhibitor
Name:
BDBM50587701
Synonyms:
CHEMBL5180326
Type:
Small organic molecule
Emp. Form.:
C32H30N2O4
Mol. Mass.:
506.5916
SMILES:
[H][C@@]12C[C@]3([C@H](c4ccc(C)cc4)[C@@]1([H])C=C(C=O)[C@H]([C@@H]2[N+]([O-])=O)c1ccc(C)cc1)C(=O)N(C)c1ccccc31
: