Target
Histone deacetylase 9
Ligand
BDBM50380399
Substrate
Meas. Tech.
ChEMBL_2184734 (CHEMBL5096816)
IC50
>30000±n/a nM
Citation
 Zhang, XHQin-Ma, naWu, HPKhamis, MYLi, YHMa, LYLiu, HM A Review of Progress in Histone Deacetylase 6 Inhibitors Research: Structural Specificity and Functional Diversity. J Med Chem 64:1362-1391 (2021) Target
Name:
Histone deacetylase 9
Synonyms:
HD9 HDAC7B HDAC9_HUMAN Histone acetylase 9 (HDAC9) Histone deacetylase 9 (HDAC9) Human HDAC9 MITR
Type:
Enzyme
Mol. Mass.:
111304.31
Organism:
Homo sapiens (Human)
Description:
Q9UKV0
Residue:
1011
  
Inhibitor
Name:
BDBM50380399
Synonyms:
CHEMBL2018302 US10227295, Compound Tubastatin A US11207431, Example D US9249087, Tubacin US9956192, Compound Tubastatin-A
Type:
Small organic molecule
Emp. Form.:
C20H21N3O2
Mol. Mass.:
335.3996
SMILES:
CN1CCc2c(C1)c1ccccc1n2Cc1ccc(cc1)C(=O)NO
: