Target
Methionine aminopeptidase 1
Ligand
BDBM50433375
Substrate
Meas. Tech.
ChEMBL_2184794 (CHEMBL5096876)
IC50
700±n/a nM
Citation
 Mills, BIsaac, REFoster, R Metalloaminopeptidases of the Protozoan Parasite  J Med Chem 64:1763-1785 (2021) Target
Name:
Methionine aminopeptidase 1
Synonyms:
Aminopeptidase MAP 1 METAP1 Methionine Aminopeptidase Type 1 (MetAP1) | Peptidase M 1
Type:
Enzyme
Mol. Mass.:
43220.79
Organism:
Homo sapiens (Human)
Description:
MetAP1 with an N-terminal six histidine tag was expressed in baculovirus infected sf9 cells.
Residue:
386
  
Inhibitor
Name:
BDBM50433375
Synonyms:
CHEMBL472879 | GNF-Pf-359
Type:
Small organic molecule
Emp. Form.:
C18H17ClN4
Mol. Mass.:
324.807
SMILES:
Cc1nc(nc(NCCc2ccccc2)c1Cl)-c1ccccn1
: