Target
Proto-oncogene tyrosine-protein kinase Src
Ligand
BDBM50119570
Substrate
Meas. Tech.
ChEMBL_2185238 (CHEMBL5097320)
Ki
20±n/a nM
Citation
 Lee, SKim, JJo, JChang, JWSim, JYun, H Recent advances in development of hetero-bivalent kinase inhibitors. Eur J Med Chem 216:0 (2021) Target
Name:
Proto-oncogene tyrosine-protein kinase Src
Synonyms:
Calmodulin/Proto-oncogene tyrosine-protein kinase Src Proto-oncogene c-Src SRC SRC_HUMAN V-src sarcoma (Schmidt-Ruppin A-2) viral oncogene homolog (avian) p60-Src | pp60c-src
Type:
Protein
Mol. Mass.:
59838.60
Organism:
Homo sapiens (Human)
Description:
P12931
Residue:
536
  
Inhibitor
Name:
BDBM50119570
Synonyms:
CHEMBL3617731
Type:
Small organic molecule
Emp. Form.:
C19H21N7OS
Mol. Mass.:
395.481
SMILES:
SCCC(=O)Nc1cccc(Nc2nccc(Nc3cc([nH]n3)C3CC3)n2)c1
: