Target
Protein kinase C delta type
Ligand
BDBM13216
Substrate
Meas. Tech.
ChEMBL_430275 (CHEMBL913901)
IC50
>50000±n/a nM
Citation
 Lombardo, LJLee, FYChen, PNorris, DBarrish, JCBehnia, KCastaneda, SCornelius, LADas, JDoweyko, AMFairchild, CHunt, JTInigo, IJohnston, KKamath, AKan, DKlei, HMarathe, PPang, SPeterson, RPitt, SSchieven, GLSchmidt, RJTokarski, JWen, MLWityak, JBorzilleri, RM Discovery of N-(2-chloro-6-methyl- phenyl)-2-(6-(4-(2-hydroxyethyl)- piperazin-1-yl)-2-methylpyrimidin-4- ylamino)thiazole-5-carboxamide (BMS-354825), a dual Src/Abl kinase inhibitor with potent antitumor activity in preclinical assays. J Med Chem 47:6658-61 (2004)  
Target
Name:
Protein kinase C delta type
Synonyms:
KPCD_HUMAN PKCD Protein Kinase C- delta nPKC-delta
Type:
Enzyme
Mol. Mass.:
77516.79
Organism:
Homo sapiens (Human)
Description:
The recombinant human PKC enzymes were produced using a baculovirus expression system in SF9 cells
Residue:
676
  
Inhibitor
Name:
BDBM13216
Synonyms:
BMS-354825 DASATINIB N-(2-chloro-6-methylphenyl)-2-({6-[4-(2-hydroxyethyl)piperazin-1-yl]-2-methylpyrimidin-4-yl}amino)-1,3-thiazole-5-carboxamide US20230348453, Compound A8 med.21724, Compound Dasatinib
Type:
Small organic molecule
Emp. Form.:
C22H26ClN7O2S
Mol. Mass.:
488.006
SMILES:
Cc1nc(Nc2ncc(s2)C(=O)Nc2c(C)cccc2Cl)cc(n1)N1CCN(CCO)CC1
: