Target
Tyrosine-protein kinase ITK/TSK
Ligand
BDBM50588040
Substrate
Meas. Tech.
ChEMBL_2186313 (CHEMBL5098395)
Kd
190±n/a nM
Citation
 Hopkins, BTBame, EBell, NBohnert, TBowden-Verhoek, JKBui, MCancilla, MTConlon, PCullen, PErlanson, DAFan, JFuchs-Knotts, THansen, SHeumann, SJenkins, TJGua, CLiu, YLiu, YLulla, MMarcotte, DMarx, IMcDowell, BMertsching, ENegrou, ERomanowski, MJScott, DSilvian, LYang, WZhong, M Utilizing structure based drug design and metabolic soft spot identification to optimize the in vitro potency and in vivo pharmacokinetic properties leading to the discovery of novel reversible Bruton's tyrosine kinase inhibitors. Bioorg Med Chem 44:0 (2021) Target
Name:
Tyrosine-protein kinase ITK/TSK
Synonyms:
EMT ITK_HUMAN LYK Tyrosine-protein kinase ITK Tyrosine-protein kinase Lyk
Type:
Protein
Mol. Mass.:
71839.20
Organism:
Homo sapiens (Human)
Description:
Q08881
Residue:
620
  
Inhibitor
Name:
BDBM50588040
Synonyms:
CHEMBL5196736
Type:
Small organic molecule
Emp. Form.:
C21H23ClFN7O
Mol. Mass.:
443.905
SMILES:
Fc1cc(Cl)cc(N[C@H](C2CC2)C(=O)N[C@@H]2CCCN(C2)c2ncnc3[nH]ncc23)c1
: