Target
Tubulin beta-1 chain
Ligand
BDBM50159313
Substrate
Meas. Tech.
ChEMBL_305199 (CHEMBL832453)
IC50
510±n/a nM
Citation
 Ducki, SMackenzie, GLawrence, NJSnyder, JP Quantitative structure-activity relationship (5D-QSAR) study of combretastatin-like analogues as inhibitors of tubulin assembly. J Med Chem 48:457-65 (2005)  
Target
Name:
Tubulin beta-1 chain
Synonyms:
TBB1_HUMAN | TUBB1
Type:
PROTEIN
Mol. Mass.:
50311.77
Organism:
Homo sapiens (Human)
Description:
ChEMBL_305173
Residue:
451
  
Inhibitor
Name:
BDBM50159313
Synonyms:
(Z)-3-(3''-Hydroxy-4''-methoxyphenyl)-2-methoxy-1-(3',4',5'-timethoxyphenyl)prop-2-en-1-one CHEMBL364034
Type:
Small organic molecule
Emp. Form.:
C20H22O7
Mol. Mass.:
374.3845
SMILES:
CO\C(=C/c1ccc(OC)c(O)c1)C(=O)c1cc(OC)c(OC)c(OC)c1
: