Target
Adenosine receptor A1
Ligand
BDBM50159966
Substrate
Meas. Tech.
ChEMBL_303694 (CHEMBL829739)
Ki
>10000±n/a nM
Citation
 Zablocki, JKalla, RPerry, TPalle, VVarkhedkar, VXiao, DPiscopio, AMaa, TGimbel, AHao, JChu, NLeung, KZeng, D The discovery of a selective, high affinity A(2B) adenosine receptor antagonist for the potential treatment of asthma. Bioorg Med Chem Lett 15:609-12 (2005)  
Target
Name:
Adenosine receptor A1
Synonyms:
A1 adenosine receptor (hA1) AA1R_HUMAN ADORA1 Adenosine A1-receptor Adenosine receptor A1 (hA1) | Adenosine transporter (AdT)
Type:
G Protein-Coupled Receptor (GPCR)
Mol. Mass.:
36520.92
Organism:
Homo sapiens (Human)
Description:
P30542
Residue:
326
  
Inhibitor
Name:
BDBM50159966
Synonyms:
1,3-Dipropyl-8-[4-(5-o-tolyl-[1,2,4]oxadiazol-3-ylmethoxy)-phenyl]-3,7-dihydro-purine-2,6-dione | CHEMBL181873
Type:
Small organic molecule
Emp. Form.:
C27H28N6O4
Mol. Mass.:
500.549
SMILES:
CCCn1c2nc([nH]c2c(=O)n(CCC)c1=O)-c1ccc(OCc2noc(n2)-c2ccccc2C)cc1
: