Target
Translocator protein
Ligand
BDBM50060095
Substrate
Meas. Tech.
ChEMBL_2191890 (CHEMBL5104250)
EC50
337±n/a nM
Citation
 Barresi, ERobello, MCosta, BDa Pozzo, EBaglini, ESalerno, SDa Settimo, FMartini, CTaliani, S An update into the medicinal chemistry of translocator protein (TSPO) ligands. Eur J Med Chem 209:0 (2021) Target
Name:
Translocator protein
Synonyms:
BZRP Mitochondrial benzodiazepine receptor PKBS Peripheral-type benzodiazepine receptor TSPO_HUMAN
Type:
Enzyme
Mol. Mass.:
18834.74
Organism:
Homo sapiens (Human)
Description:
P30536
Residue:
169
  
Inhibitor
Name:
BDBM50060095
Synonyms:
2-[6,8-Dichloro-2-(4-chloro-phenyl)-imidazo[1,2-a]pyridin-3-yl]-N,N-dipropyl-acetamide | CHEMBL432608
Type:
Small organic molecule
Emp. Form.:
C21H22Cl3N3O
Mol. Mass.:
438.778
SMILES:
CCCN(CCC)C(=O)Cc1c(nc2c(Cl)cc(Cl)cn12)-c1ccc(Cl)cc1
: