Target
Alpha-1A adrenergic receptor
Ligand
BDBM50030619
Substrate
Meas. Tech.
ChEMBL_303162 (CHEMBL829974)
Ki
3300±n/a nM
Citation
 Li, MYTsai, KCXia, L Pharmacophore identification of alpha(1A)-adrenoceptor antagonists. Bioorg Med Chem Lett 15:657-64 (2005)  
Target
Name:
Alpha-1A adrenergic receptor
Synonyms:
ADA1A_HUMAN ADRA1C Alpha 1A-adrenoceptor Alpha adrenergic receptor 1a Alpha-adrenergic receptor 1c adrenergic Alpha1 | adrenergic Alpha1C
Type:
Cell-surface receptors
Mol. Mass.:
51511.67
Organism:
Homo sapiens (Human)
Description:
P35348
Residue:
466
  
Inhibitor
Name:
BDBM50030619
Synonyms:
1-Bromo-5-chloro-8-methyl-6,7,8,9-tetrahydro-2-oxa-8-aza-benzo[cd]azulene SK&F-105854 | SK-105854
Type:
Small organic molecule
Emp. Form.:
C12H11BrClNO
Mol. Mass.:
300.579
SMILES:
CN1CCc2c(Cl)ccc3oc(Br)c(C1)c23
: