Target
Carbonic anhydrase 9
Ligand
BDBM50589086
Substrate
Meas. Tech.
ChEMBL_2191939 (CHEMBL5104299)
IC50
6.6±n/a nM
Citation
 Kumar, SRulhania, SJaswal, SMonga, V Recent advances in the medicinal chemistry of carbonic anhydrase inhibitors. Eur J Med Chem 209:0 (2021) Target
Name:
Carbonic anhydrase 9
Synonyms:
CA-IX CAH9_HUMAN Carbonic anhydrase 9 (CA IX) Carbonic anhydrase 9 precursor Carbonic anhydrase IX (CAIX) Carbonic anhydrases; II & IX MN RCC-associated antigen G250
Type:
Enzyme
Mol. Mass.:
49669.03
Organism:
Homo sapiens (Human)
Description:
Catalytic domain of human cloned isozyme was used in the assay
Residue:
459
  
Inhibitor
Name:
BDBM50589086
Synonyms:
CHEMBL5195955
Type:
Small organic molecule
Emp. Form.:
C13H12N4O2S
Mol. Mass.:
288.325
SMILES:
Cn1c(nc2cc(ccc12)S(N)(=O)=O)-c1ccccn1
: