Target
Carbonic anhydrase 12
Ligand
BDBM50589085
Substrate
Meas. Tech.
ChEMBL_2191940 (CHEMBL5104300)
IC50
>360±n/a nM
Citation
 Kumar, SRulhania, SJaswal, SMonga, V Recent advances in the medicinal chemistry of carbonic anhydrase inhibitors. Eur J Med Chem 209:0 (2021) Target
Name:
Carbonic anhydrase 12
Synonyms:
CA-XII CAH12_HUMAN Carbonic anhydrase Carbonic anhydrase XII Carbonic anhydrase XII (CAXII) | Tumor antigen HOM-RCC-3.1.3
Type:
Enzyme
Mol. Mass.:
39456.00
Organism:
Homo sapiens (Human)
Description:
Catalytic domain of human cloned isozyme was used in the assay
Residue:
354
  
Inhibitor
Name:
BDBM50589085
Synonyms:
CHEMBL5182480
Type:
Small organic molecule
Emp. Form.:
C14H12ClN3O2S
Mol. Mass.:
321.782
SMILES:
Cn1c(nc2cc(ccc12)S(N)(=O)=O)-c1ccc(Cl)cc1
: