Target
Carbonic anhydrase 12
Ligand
BDBM50589087
Substrate
Meas. Tech.
ChEMBL_2191940 (CHEMBL5104300)
IC50
10±n/a nM
Citation
 Kumar, SRulhania, SJaswal, SMonga, V Recent advances in the medicinal chemistry of carbonic anhydrase inhibitors. Eur J Med Chem 209:0 (2021) Target
Name:
Carbonic anhydrase 12
Synonyms:
CA-XII CAH12_HUMAN Carbonic anhydrase Carbonic anhydrase XII Carbonic anhydrase XII (CAXII) | Tumor antigen HOM-RCC-3.1.3
Type:
Enzyme
Mol. Mass.:
39456.00
Organism:
Homo sapiens (Human)
Description:
Catalytic domain of human cloned isozyme was used in the assay
Residue:
354
  
Inhibitor
Name:
BDBM50589087
Synonyms:
CHEMBL5199602
Type:
Small organic molecule
Emp. Form.:
C14H14N4O4S2
Mol. Mass.:
366.415
SMILES:
Cn1c(nc2cc(ccc12)S(N)(=O)=O)-c1ccc(cc1)S(N)(=O)=O
: