Target
Carbonic anhydrase 12
Ligand
BDBM50589100
Substrate
Meas. Tech.
ChEMBL_2191940 (CHEMBL5104300)
IC50
>360±n/a nM
Citation
 Kumar, SRulhania, SJaswal, SMonga, V Recent advances in the medicinal chemistry of carbonic anhydrase inhibitors. Eur J Med Chem 209:0 (2021) Target
Name:
Carbonic anhydrase 12
Synonyms:
CA-XII CAH12_HUMAN Carbonic anhydrase Carbonic anhydrase XII Carbonic anhydrase XII (CAXII) | Tumor antigen HOM-RCC-3.1.3
Type:
Enzyme
Mol. Mass.:
39456.00
Organism:
Homo sapiens (Human)
Description:
Catalytic domain of human cloned isozyme was used in the assay
Residue:
354
  
Inhibitor
Name:
BDBM50589100
Synonyms:
CHEMBL5193183
Type:
Small organic molecule
Emp. Form.:
C14H13BN2O2
Mol. Mass.:
252.076
SMILES:
Cn1c(nc2ccccc12)-c1ccc(cc1)B(O)O
: