Target
DNA polymerase III PolC-type
Ligand
BDBM50160350
Substrate
Meas. Tech.
ChEMBL_303023 (CHEMBL830411)
Ki
80±n/a nM
Citation
 Wright, GEBrown, NCXu, WCLong, ZYZhi, CGambino, JJBarnes, MHButler, MM Active site directed inhibitors of replication-specific bacterial DNA polymerases. Bioorg Med Chem Lett 15:729-32 (2005)  
Target
Name:
DNA polymerase III PolC-type
Synonyms:
DNA polymerase III DNA-directed DNA polymerase PolIII mutI | polC
Type:
Enzyme
Mol. Mass.:
162625.67
Organism:
Bacillus subtilis
Description:
Enzyme was purified from recombinant strains.
Residue:
1437
  
Inhibitor
Name:
BDBM50160350
Synonyms:
Acetic acid (R)-5-[2-(3,4-dichloro-benzylamino)-6-oxo-1,6-dihydro-purin-7-yl]-1-methyl-pentyl ester | CHEMBL369308
Type:
Small organic molecule
Emp. Form.:
C20H23Cl2N5O3
Mol. Mass.:
452.334
SMILES:
C[C@H](CCCCn1cnc2nc(NCc3ccc(Cl)c(Cl)c3)[nH]c(=O)c12)OC(C)=O
: