Target
DNA polymerase III subunit alpha
Ligand
BDBM50160350
Substrate
Meas. Tech.
ChEMBL_302895 (CHEMBL830211)
Ki
20300±n/a nM
Citation
 Wright, GEBrown, NCXu, WCLong, ZYZhi, CGambino, JJBarnes, MHButler, MM Active site directed inhibitors of replication-specific bacterial DNA polymerases. Bioorg Med Chem Lett 15:729-32 (2005)  
Target
Name:
DNA polymerase III subunit alpha
Synonyms:
DNA polymerase III dnaE DNA polymerase IIIE dnaE | polC
Type:
Enzyme
Mol. Mass.:
129872.84
Organism:
Escherichia coli
Description:
Enzyme was purified from recombinant strains.
Residue:
1160
  
Inhibitor
Name:
BDBM50160350
Synonyms:
Acetic acid (R)-5-[2-(3,4-dichloro-benzylamino)-6-oxo-1,6-dihydro-purin-7-yl]-1-methyl-pentyl ester | CHEMBL369308
Type:
Small organic molecule
Emp. Form.:
C20H23Cl2N5O3
Mol. Mass.:
452.334
SMILES:
C[C@H](CCCCn1cnc2nc(NCc3ccc(Cl)c(Cl)c3)[nH]c(=O)c12)OC(C)=O
: