Target
Neuronal acetylcholine receptor subunit alpha-7
Ligand
BDBM50023331
Substrate
Meas. Tech.
ChEMBL_302176 (CHEMBL830079)
Kd
1.06±n/a nM
Citation
 Kanne, DBTomizawa, MDurkin, KACasida, JE 6'-Methylpyrido[3,4-b]norhomotropane: synthesis and outstanding potency in relation to the alpha4beta2 nicotinic receptor pharmacophore model. Bioorg Med Chem Lett 15:877-81 (2005)  
Target
Name:
Neuronal acetylcholine receptor subunit alpha-7
Synonyms:
ACHA7_HUMAN Cholinergic, Nicotinic Alpha7 Neuronal acetylcholine receptor protein alpha-7 subunit Nicotinic acetylcholine receptor alpha-7 (alpha7 nAChR)
Type:
Mol. Mass.:
56448.33
Organism:
Homo sapiens (Human)
Description:
CHRNA7 (NACHRA7)
Residue:
502
  
Inhibitor
Name:
BDBM50023331
Synonyms:
(+)-pyrido[3,4-b]homotropane (-)-pyrido[3,4-b]homotropane 4,13-Diaza-tricyclo[8.2.1.0*2,7*]trideca-2(7),3,5-triene(PHT) | CHEMBL149667
Type:
Small organic molecule
Emp. Form.:
C11H14N2
Mol. Mass.:
174.2423
SMILES:
C1CC2NC1CCc1ccncc21
: