Target
Caspase-8
Ligand
BDBM50160967
Substrate
Meas. Tech.
ChEMBL_305653 (CHEMBL829511)
IC50
>10±n/a nM
Citation
 Han, YGiroux, AColucci, JBayly, CIMckay, DJRoy, SXanthoudakis, SVaillancourt, JRasper, DMTam, JTawa, PNicholson, DWZamboni, RJ Novel pyrazinone mono-amides as potent and reversible caspase-3 inhibitors. Bioorg Med Chem Lett 15:1173-80 (2005)  
Target
Name:
Caspase-8
Synonyms:
Apoptotic cysteine protease CAP4 CASP8 Caspase Caspase-8 subunit p18 FADD-like ICE ICE-like apoptotic protease 5 MCH5 | MORT1-associated CED-3 homolog
Type:
Enzyme
Mol. Mass.:
55373.89
Organism:
Homo sapiens (Human)
Description:
Q14790
Residue:
479
  
Inhibitor
Name:
BDBM50160967
Synonyms:
(S)-5-(Dimethylaminomethyl-amino)-3-(2-{3-[(4-methyl-furazan-3-ylmethyl)-amino]-2-oxo-2H-pyrazin-1-yl}-butyrylamino)-4-oxo-pentanoic acid | CHEMBL181027
Type:
Small organic molecule
Emp. Form.:
C20H30N8O6
Mol. Mass.:
478.5022
SMILES:
CCC(C(=O)N[C@@H](CC(O)=O)C(=O)CNCN(C)C)n1ccnc(NCc2nonc2C)c1=O
: