Target
Ephrin type-A receptor 8
Ligand
BDBM4779
Substrate
Meas. Tech.
ChEMBL_325041 (CHEMBL860777)
Kd
790±n/a nM
Citation
 Fabian, MABiggs, WHTreiber, DKAtteridge, CEAzimioara, MDBenedetti, MGCarter, TACiceri, PEdeen, PTFloyd, MFord, JMGalvin, MGerlach, JLGrotzfeld, RMHerrgard, SInsko, DEInsko, MALai, AGLélias, JMMehta, SAMilanov, ZVVelasco, AMWodicka, LMPatel, HKZarrinkar, PPLockhart, DJ A small molecule-kinase interaction map for clinical kinase inhibitors. Nat Biotechnol 23:329-36 (2005)  
Target
Name:
Ephrin type-A receptor 8
Synonyms:
EEK EPHA8_HUMAN Ephrin type-A receptor 8 KIAA1459
Type:
PROTEIN
Mol. Mass.:
111022.09
Organism:
Homo sapiens (Human)
Description:
ChEMBL_774600
Residue:
1005
  
Inhibitor
Name:
BDBM4779
Synonyms:
CHEMBL31965 CI-1033 N-{4-[(3-chloro-4-fluorophenyl)amino]-7-[3-(morpholin-4-yl)propoxy]quinazolin-6-yl}prop-2-enamide US10507209, Compound CI-1033 cid_156414
Type:
Small organic molecule
Emp. Form.:
C24H25ClFN5O3
Mol. Mass.:
485.938
SMILES:
Fc1ccc(Nc2ncnc3cc(OCCCN4CCOCC4)c(NC(=O)C=C)cc23)cc1Cl
: