Target
Prostaglandin D2 receptor 2
Ligand
BDBM50161745
Substrate
Meas. Tech.
ChEMBL_303661 (CHEMBL830422)
Ki
0.600000±n/a nM
Citation
 Ulven, TKostenis, E Minor structural modifications convert the dual TP/CRTH2 antagonist ramatroban into a highly selective and potent CRTH2 antagonist. J Med Chem 48:897-900 (2005)  
Target
Name:
Prostaglandin D2 receptor 2
Synonyms:
CD_antigen=CD294 Chemoattractant Receptor-homologous molecule expressed on T-helper type 2 cells (CRTH2) Chemoattractant receptor-homologous molecule expressed on Th2 cells (CRTH2) G protein-coupled receptor 44 GPR44 PTGDR2 Prostaglandin D2 receptor 2 | Prostaglandin D2 receptor 2 (PGD2)
Type:
Enzyme
Mol. Mass.:
43295.45
Organism:
Homo sapiens (Human)
Description:
Q9Y5Y4
Residue:
395
  
Inhibitor
Name:
BDBM50161745
Synonyms:
CHEMBL179036 | {3-[((R)-4-Fluoro-benzenesulfonyl)-methyl-amino]-1,2,3,4-tetrahydro-carbazol-9-yl}-acetic acid
Type:
Small organic molecule
Emp. Form.:
C21H21FN2O4S
Mol. Mass.:
416.466
SMILES:
CN([C@@H]1CCc2c(C1)c1ccccc1n2CC(O)=O)S(=O)(=O)c1ccc(F)cc1
: