Target
Focal adhesion kinase 1
Ligand
BDBM50590487
Substrate
Meas. Tech.
ChEMBL_2196876 (CHEMBL5109392)
IC50
0.314600±n/a nM
Citation
 Zheng, XLi, XTian, LWu, BYu, JWang, CSun, XMa, XChen, LLi, Y Design, synthesis and activity evaluation of isopropylsulfonyl-substituted 2,4- diarylaminopyrimidine derivatives as FAK inhibitors for the potential treatment of pancreatic cancer. Eur J Med Chem 241:0 (2022) Target
Name:
Focal adhesion kinase 1
Synonyms:
FADK 1 FAK1 FLT4 Focal adhesion kinase (FAK) Focal adhesion kinase 1 (FAK) Focal adhesion kinase-related nonkinase PTK2 Protein-tyrosine kinase 2 p125FAK | pp125FAK
Type:
Tyrosine-protein kinase
Mol. Mass.:
119233.17
Organism:
Homo sapiens (Human)
Description:
Q05397
Residue:
1052
  
Inhibitor
Name:
BDBM50590487
Synonyms:
CHEMBL5199835
Type:
Small organic molecule
Emp. Form.:
C34H44ClN7O6S
Mol. Mass.:
714.274
SMILES:
COC(=O)CCCCCNC(=O)C1CCN(CC(=O)Nc2ccc(Nc3ncc(Cl)c(Nc4ccccc4S(=O)(=O)C(C)C)n3)cc2)CC1
: