Target
Collagenase 3
Ligand
BDBM50162737
Substrate
Meas. Tech.
ChEMBL_305328 (CHEMBL833549)
IC50
52±n/a nM
Citation
 Zask, AKaplan, JDu, XMacEwan, GSandanayaka, VEudy, NLevin, JJin, GXu, JCummons, TBarone, DAyral-Kaloustian, SSkotnicki, J Synthesis and SAR of diazepine and thiazepine TACE and MMP inhibitors. Bioorg Med Chem Lett 15:1641-5 (2005)  
Target
Name:
Collagenase 3
Synonyms:
MMP-13 MMP13_HUMAN Matrix metalloproteinase-13 (MMP-13) | Matrix metalloproteinase-13 (MMP13)
Type:
Enzyme
Mol. Mass.:
53808.06
Organism:
Homo sapiens (Human)
Description:
P45452
Residue:
471
  
Inhibitor
Name:
BDBM50162737
Synonyms:
4-Benzyl-1-(4-but-2-ynyloxy-benzenesulfonyl)-[1,4]diazepane-2-carboxylic acid hydroxyamide | CHEMBL180333
Type:
Small organic molecule
Emp. Form.:
C23H27N3O5S
Mol. Mass.:
457.543
SMILES:
CC#CCOc1ccc(cc1)S(=O)(=O)N1CCCN(Cc2ccccc2)CC1C(=O)NO
: