Target
Tryptase beta-2
Ligand
BDBM50162760
Substrate
Meas. Tech.
ChEMBL_304961 (CHEMBL827839)
IC50
4400±n/a nM
Citation
 del Fresno, MFernández-Forner, DMiralpeix, MSegarra, VRyder, HRoyo, MAlbericio, F Combinatorial approaches towards the discovery of new tryptase inhibitors. Bioorg Med Chem Lett 15:1659-64 (2005)  
Target
Name:
Tryptase beta-2
Synonyms:
TPS2 TRYB2_HUMAN Tryptase II Tryptase-2
Type:
PROTEIN
Mol. Mass.:
30518.79
Organism:
Homo sapiens (Human)
Description:
ChEMBL_210702
Residue:
275
  
Inhibitor
Name:
BDBM50162760
Synonyms:
4-Guanidino-N-[(S)-4-((S)-5-{4-[2-(2-imino-imidazolidin-1-yl)-acetylamino]-butyl}-3,6-dioxo-piperazin-2-yl)-butyl]-benzamide | CHEMBL362598
Type:
Small organic molecule
Emp. Form.:
C25H38N10O4
Mol. Mass.:
542.6338
SMILES:
[#7]\[#6](-[#7])=[#7]/c1ccc(cc1)-[#6](=O)-[#7]-[#6]-[#6]-[#6]-[#6]-[#6@@H]-1-[#7]-[#6](=O)-[#6@H](-[#6]-[#6]-[#6]-[#6]-[#7]-[#6](=O)-[#6]-[#7]-2-[#6]-[#6]-[#7]=[#6]-2-[#7])-[#7]-[#6]-1=O
: