Target
Tryptase beta-2
Ligand
BDBM50162759
Substrate
Meas. Tech.
ChEMBL_304961 (CHEMBL827839)
IC50
9090±n/a nM
Citation
 del Fresno, MFernández-Forner, DMiralpeix, MSegarra, VRyder, HRoyo, MAlbericio, F Combinatorial approaches towards the discovery of new tryptase inhibitors. Bioorg Med Chem Lett 15:1659-64 (2005)  
Target
Name:
Tryptase beta-2
Synonyms:
TPS2 TRYB2_HUMAN Tryptase II Tryptase-2
Type:
PROTEIN
Mol. Mass.:
30518.79
Organism:
Homo sapiens (Human)
Description:
ChEMBL_210702
Residue:
275
  
Inhibitor
Name:
BDBM50162759
Synonyms:
CHEMBL178315 | [1-(4-{(S)-5-[((S)-3-Carbamimidoyl-phenylcarbamoyl)-methyl]-3-oxo-6-oxo-piperazin-2-yl}-butylcarbamoyl)-4-guanidino-butyl]-carbamic acid 9H-fluoren-9-ylmethyl ester
Type:
Small organic molecule
Emp. Form.:
C38H46N10O6
Mol. Mass.:
738.8352
SMILES:
NC(=N)NCCCC(NC(=O)OCC1c2ccccc2-c2ccccc12)C(=O)NCCCC[C@@H]1NC(=O)[C@H](CC(=O)Nc2cccc(c2)C(N)=N)NC1=O
: