Target
D(2) dopamine receptor
Ligand
BDBM50162961
Substrate
Meas. Tech.
ChEMBL_303146 (CHEMBL829120)
Ki
5.9±n/a nM
Citation
 Fernández, JAlonso, JMAndrés, JICid, JMDíaz, AIturrino, LGil, PMegens, ASipido, VKTrabanco, AA Discovery of new tetracyclic tetrahydrofuran derivatives as potential broad-spectrum psychotropic agents. J Med Chem 48:1709-12 (2005)  
Target
Name:
D(2) dopamine receptor
Synonyms:
D(2) dopamine receptor DOPAMINE D2 Long DRD2 Dopamine D2 receptor Dopamine D2 receptor (D2R) Dopamine2-like | d2
Type:
Cell-surface receptors
Mol. Mass.:
50647.10
Organism:
Homo sapiens (Human)
Description:
P14416
Residue:
443
  
Inhibitor
Name:
BDBM50162961
Synonyms:
(11-Chloro-2,3,3a,12b-tetrahydro-1,8-dioxa-dibenzo[e,h]azulen-2-ylmethyl)-dimethyl-amine | CHEMBL435301
Type:
Small organic molecule
Emp. Form.:
C19H20ClNO2
Mol. Mass.:
329.821
SMILES:
CN(C)C[C@H]1CC2[C@H](O1)c1cc(Cl)ccc1Oc1ccccc21
: