Target
5-hydroxytryptamine receptor 2A
Ligand
BDBM50162961
Substrate
Meas. Tech.
ChEMBL_303104 (CHEMBL829614)
Ki
6±n/a nM
Citation
 Fernández, JAlonso, JMAndrés, JICid, JMDíaz, AIturrino, LGil, PMegens, ASipido, VKTrabanco, AA Discovery of new tetracyclic tetrahydrofuran derivatives as potential broad-spectrum psychotropic agents. J Med Chem 48:1709-12 (2005)  
Target
Name:
5-hydroxytryptamine receptor 2A
Synonyms:
5-HT-2 5-HT2A 5-hydroxytryptamine receptor 2A (5HT-2A) 5HT2A_HUMAN HTR2A | Serotonin receptor 2A
Type:
undefined
Mol. Mass.:
52607.65
Organism:
Homo sapiens (Human)
Description:
P28223
Residue:
471
  
Inhibitor
Name:
BDBM50162961
Synonyms:
(11-Chloro-2,3,3a,12b-tetrahydro-1,8-dioxa-dibenzo[e,h]azulen-2-ylmethyl)-dimethyl-amine | CHEMBL435301
Type:
Small organic molecule
Emp. Form.:
C19H20ClNO2
Mol. Mass.:
329.821
SMILES:
CN(C)C[C@H]1CC2[C@H](O1)c1cc(Cl)ccc1Oc1ccccc21
: