Target
Histamine H1 receptor
Ligand
BDBM50162959
Substrate
Meas. Tech.
ChEMBL_303185 (CHEMBL829679)
Ki
1.4±n/a nM
Citation
 Fernández, JAlonso, JMAndrés, JICid, JMDíaz, AIturrino, LGil, PMegens, ASipido, VKTrabanco, AA Discovery of new tetracyclic tetrahydrofuran derivatives as potential broad-spectrum psychotropic agents. J Med Chem 48:1709-12 (2005)  
Target
Name:
Histamine H1 receptor
Synonyms:
H1R HISTAMINE H1 HRH1_HUMAN
Type:
G Protein-Coupled Receptor (GPCR)
Mol. Mass.:
55808.72
Organism:
Homo sapiens (Human)
Description:
Cell pellets from SK-N-MC cells transfected with human H1 receptor were used in binding assay.
Residue:
487
  
Inhibitor
Name:
BDBM50162959
Synonyms:
(11-Fluoro-2,3,3a,12b-tetrahydro-1-oxa-8-thia-dibenzo[e,h]azulen-2-ylmethyl)-dimethyl-amine | CHEMBL366164
Type:
Small organic molecule
Emp. Form.:
C19H20FNOS
Mol. Mass.:
329.432
SMILES:
CN(C)C[C@H]1C[C@H]2[C@H](O1)c1cc(F)ccc1Sc1ccccc21
: