Target
5-hydroxytryptamine receptor 2A
Ligand
BDBM50162956
Substrate
Meas. Tech.
ChEMBL_303104 (CHEMBL829614)
Ki
2.5±n/a nM
Citation
 Fernández, JAlonso, JMAndrés, JICid, JMDíaz, AIturrino, LGil, PMegens, ASipido, VKTrabanco, AA Discovery of new tetracyclic tetrahydrofuran derivatives as potential broad-spectrum psychotropic agents. J Med Chem 48:1709-12 (2005)  
Target
Name:
5-hydroxytryptamine receptor 2A
Synonyms:
5-HT-2 5-HT2A 5-hydroxytryptamine receptor 2A (5HT-2A) 5HT2A_HUMAN HTR2A | Serotonin receptor 2A
Type:
undefined
Mol. Mass.:
52607.65
Organism:
Homo sapiens (Human)
Description:
P28223
Residue:
471
  
Inhibitor
Name:
BDBM50162956
Synonyms:
CHEMBL371352 | Dimethyl-(11-methyl-3,3a,8,12b-tetrahydro-2H-1-oxa-dibenzo[e,h]azulen-2-ylmethyl)-amine
Type:
Small organic molecule
Emp. Form.:
C20H23NO
Mol. Mass.:
293.4027
SMILES:
CN(C)C[C@H]1CC2[C@H](O1)c1ccccc1Cc1ccccc21
: