Target
Adenosine receptor A3
Ligand
BDBM50163010
Substrate
Meas. Tech.
ChEMBL_303147 (CHEMBL829121)
Ki
400±n/a nM
Citation
 Tchilibon, SJoshi, BVKim, SKDuong, HTGao, ZGJacobson, KA (N)-methanocarba 2,N6-disubstituted adenine nucleosides as highly potent and selective A3 adenosine receptor agonists. J Med Chem 48:1745-58 (2005)  
Target
Name:
Adenosine receptor A3
Synonyms:
AA3R_RAT Adenosine receptor A2a and A3 | Adora3
Type:
PROTEIN
Mol. Mass.:
36643.73
Organism:
Rattus norvegicus
Description:
ChEMBL_479910
Residue:
320
  
Inhibitor
Name:
BDBM50163010
Synonyms:
(2R,3S,4R,5R)-2-Hydroxymethyl-5-[6-(2-phenyl-cyclopropylamino)-purin-9-yl]-tetrahydro-furan-3,4-diol | CHEMBL193421
Type:
Small organic molecule
Emp. Form.:
C19H21N5O4
Mol. Mass.:
383.4011
SMILES:
OC[C@H]1O[C@H]([C@H](O)[C@@H]1O)n1cnc2c(NC3CC3c3ccccc3)ncnc12
: