Target
Adenosine receptor A2a
Ligand
BDBM50163010
Substrate
Meas. Tech.
ChEMBL_303207 (CHEMBL829833)
Ki
2500±n/a nM
Citation
 Tchilibon, SJoshi, BVKim, SKDuong, HTGao, ZGJacobson, KA (N)-methanocarba 2,N6-disubstituted adenine nucleosides as highly potent and selective A3 adenosine receptor agonists. J Med Chem 48:1745-58 (2005)  
Target
Name:
Adenosine receptor A2a
Synonyms:
A2A adenosine receptor (hA2A) ADENOSINE A2 ADORA2 Adenosine A2A receptor (A2AAR)
Type:
G Protein-Coupled Receptor (GPCR)
Mol. Mass.:
44716.46
Organism:
Homo sapiens (Human)
Description:
P29274
Residue:
412
  
Inhibitor
Name:
BDBM50163010
Synonyms:
(2R,3S,4R,5R)-2-Hydroxymethyl-5-[6-(2-phenyl-cyclopropylamino)-purin-9-yl]-tetrahydro-furan-3,4-diol | CHEMBL193421
Type:
Small organic molecule
Emp. Form.:
C19H21N5O4
Mol. Mass.:
383.4011
SMILES:
OC[C@H]1O[C@H]([C@H](O)[C@@H]1O)n1cnc2c(NC3CC3c3ccccc3)ncnc12
: