Target
Transcription activator BRG1
Ligand
BDBM50591346
Substrate
Meas. Tech.
ChEMBL_2200139 (CHEMBL5112655)
Kd
142000±n/a nM
Citation
 Shishodia, SNuņez, RStrohmier, BPBursch, KLGoetz, CJOlp, MDJensen, DRFenske, TGOrdonez-Rubiano, SCBlau, MERoach, MKPeterson, FCVolkman, BFDykhuizen, ECSmith, BC Selective and Cell-Active PBRM1 Bromodomain Inhibitors Discovered through NMR Fragment Screening. J Med Chem 65:13714-13735 (2022) Target
Name:
Transcription activator BRG1
Synonyms:
ATP-dependent helicase SMARCA4 BRG1 Mitotic growth and transcription activator Protein brahma homolog 1 SMCA4_HUMAN SNF2B SWI/SNF-related matrix-associated actin-dependent regulator of chromatin subfamily A member 4
Type:
PROTEIN
Mol. Mass.:
184666.66
Organism:
Homo sapiens (Human)
Description:
ChEMBL_107968
Residue:
1647
  
Inhibitor
Name:
BDBM50591346
Synonyms:
CHEMBL5188924
Type:
Small organic molecule
Emp. Form.:
C14H10ClFN2O
Mol. Mass.:
276.693
SMILES:
Fc1cccc(Cl)c1C1NC(=O)c2ccccc2N1
: