Target
Fucose-binding lectin PA-IIL
Ligand
BDBM50591445
Substrate
Meas. Tech.
ChEMBL_2200363 (CHEMBL5112879)
Kd
2310±n/a nM
Citation
 Ma?a, PSiebs, EMeiers, JRox, KVarrot, AImberty, ATitz, A Discovery of  J Med Chem 65:14180-14200 (2022) Target
Name:
Fucose-binding lectin PA-IIL
Synonyms:
LecB | PA-IIL
Type:
Protein
Mol. Mass.:
11857.84
Organism:
Pseudomonas aeruginosa
Description:
Q9HYN5
Residue:
115
  
Inhibitor
Name:
BDBM50591445
Synonyms:
CHEMBL5172593
Type:
Small organic molecule
Emp. Form.:
C13H17NO5
Mol. Mass.:
267.2778
SMILES:
C[C@@H]1O[C@@H](NC(=O)c2ccccc2)[C@@H](O)[C@H](O)[C@@H]1O
: