Target
Hematopoietic prostaglandin D synthase
Ligand
BDBM50591607
Substrate
Meas. Tech.
ChEMBL_2200840 (CHEMBL5113356)
IC50
78±n/a nM
Citation
 Murakami, YOsawa, HKurohara, TYanase, YIto, TYokoo, HShibata, NNaito, MAritake, KDemizu, Y Structure-activity relationship study of PROTACs against hematopoietic prostaglandin D RSC Med Chem 13:1495-1503 (2022) Target
Name:
Hematopoietic prostaglandin D synthase
Synonyms:
GSTS Glutathione-requiring prostaglandin D synthase HPGDS Hematopoietic prostaglandin D synthase Hematopoietic prostaglandin D synthase (HPGDS) PTGDS2 Prostaglandin D Synthase
Type:
Enzyme
Mol. Mass.:
23341.07
Organism:
Homo sapiens (Human)
Description:
The protein was expressed in E. coli strain BL21(DE3) with an N-terminal 6-His tag.
Residue:
199
  
Inhibitor
Name:
BDBM50591607
Synonyms:
CHEMBL5193611
Type:
Small organic molecule
Emp. Form.:
C40H45N9O7
Mol. Mass.:
763.8414
SMILES:
Cn1cccc1C(=O)N1CCN(CC1)C(=O)Nc1ccc(cc1)N1CCC(CC1)C(=O)N1CCN(CC1)c1cccc2C(=O)N(C3CCC(=O)NC3=O)C(=O)c12
: