Target
Carbonic anhydrase 1
Ligand
BDBM11640
Substrate
Meas. Tech.
ChEMBL_302804 (CHEMBL838512)
Ki
78±n/a nM
Citation
 Di Fiore, ADe Simone, GMenchise, VPedone, CCasini, AScozzafava, ASupuran, CT Carbonic anhydrase inhibitors: X-ray crystal structure of a benzenesulfonamide strong CA II and CA IX inhibitor bearing a pentafluorophenylaminothioureido tail in complex with isozyme II. Bioorg Med Chem Lett 15:1937-42 (2005)  
Target
Name:
Carbonic anhydrase 1
Synonyms:
CA-I CAB Carbonate dehydratase I Carbonic anhydrase 1 (CA I) Carbonic anhydrase 1 (Recombinant CA I) Carbonic anhydrase B Carbonic anhydrase I (CA I) Carbonic anhydrase I (CAI) Carbonic anhydrase isoenzyme I (hCA I) | hCA
Type:
Enzyme
Mol. Mass.:
28873.37
Organism:
Homo sapiens (Human)
Description:
P00915
Residue:
261
  
Inhibitor
Name:
BDBM11640
Synonyms:
3-[(2,3,4,5,6-pentafluorophenyl)amino]-1-(4-sulfamoylphenyl)thiourea Compound 9 | fluorine-containing thiourea 9
Type:
Small organic molecule
Emp. Form.:
C13H9F5N4O2S2
Mol. Mass.:
412.358
SMILES:
NS(=O)(=O)c1ccc(NC(=S)NNc2c(F)c(F)c(F)c(F)c2F)cc1
: