Target
Carbonic anhydrase 2
Ligand
BDBM11640
Substrate
Meas. Tech.
ChEMBL_302730 (CHEMBL838678)
Ki
19±n/a nM
Citation
 Di Fiore, ADe Simone, GMenchise, VPedone, CCasini, AScozzafava, ASupuran, CT Carbonic anhydrase inhibitors: X-ray crystal structure of a benzenesulfonamide strong CA II and CA IX inhibitor bearing a pentafluorophenylaminothioureido tail in complex with isozyme II. Bioorg Med Chem Lett 15:1937-42 (2005)  
Target
Name:
Carbonic anhydrase 2
Synonyms:
CA-II CAC Carbonate dehydratase II Carbonic anhydrase 2 (CA-II) Carbonic anhydrase C Carbonic anhydrase II (CA-II) Carbonic anhydrase II (hCA II) | Carbonic anhydrase isoenzyme II (hCA II)
Type:
Enzyme
Mol. Mass.:
29250.71
Organism:
Homo sapiens (Human)
Description:
P00918
Residue:
260
  
Inhibitor
Name:
BDBM11640
Synonyms:
3-[(2,3,4,5,6-pentafluorophenyl)amino]-1-(4-sulfamoylphenyl)thiourea Compound 9 | fluorine-containing thiourea 9
Type:
Small organic molecule
Emp. Form.:
C13H9F5N4O2S2
Mol. Mass.:
412.358
SMILES:
NS(=O)(=O)c1ccc(NC(=S)NNc2c(F)c(F)c(F)c(F)c2F)cc1
: