Target
Bcl-2 homologous antagonist/killer
Ligand
BDBM50591663
Substrate
Meas. Tech.
ChEMBL_2201151 (CHEMBL5113859)
IC50
280±n/a nM
Citation
 Negi, AMurphy, PV Development of Mcl-1 inhibitors for cancer therapy. Eur J Med Chem 210:0 (2021) Target
Name:
Bcl-2 homologous antagonist/killer
Synonyms:
Apoptosis regulator BAK BAK1 BCL2L7 Bcl-2-like protein 7 CDN1
Type:
PROTEIN
Mol. Mass.:
23406.37
Organism:
Homo sapiens
Description:
ChEMBL_117067
Residue:
211
  
Inhibitor
Name:
BDBM50591663
Synonyms:
CHEMBL5203189
Type:
Small organic molecule
Emp. Form.:
C42H40N2O8
Mol. Mass.:
700.7756
SMILES:
CC(CNC(=O)c1c(O)c(O)cc2c(O)c(c(C)cc12)-c1c(C)cc2c(C(=O)NC[C@@H](C)c3ccccc3)c(O)c(O)cc2c1O)c1ccccc1
: